Target
Histone deacetylase 6
Ligand
BDBM50257077
Substrate
Meas. Tech.
ChEMBL_562747 (CHEMBL1022419)
IC50
20900±n/a nM
Citation
 Mahboobi, SDove, SSellmer, AWinkler, MEichhorn, EPongratz, HCiossek, TBaer, TMaier, TBeckers, T Design of chimeric histone deacetylase- and tyrosine kinase-inhibitors: a series of imatinib hybrides as potent inhibitors of wild-type and mutant BCR-ABL, PDGF-Rbeta, and histone deacetylases. J Med Chem 52:2265-79 (2009)  
Target
Name:
Histone deacetylase 6
Synonyms:
Cereblon/Histone deacetylase 6 HDAC6 Histone deacetylase 6 (HDAC6) KIAA0901 | ORF Names:JM21
Type:
Chromatin regulator; hydrolase; repressor
Mol. Mass.:
131381.51
Organism:
Homo sapiens (Human)
Description:
Q9UBN7
Residue:
1215
  
Inhibitor
Name:
BDBM50257077
Synonyms:
CHEMBL515432 | N1-(2-aminophenyl)-N4-(4-methyl-3-(4-(pyridin-3-yl)thiazol-2-ylamino)phenyl)terephthalamide
Type:
Small organic molecule
Emp. Form.:
C29H24N6O2S
Mol. Mass.:
520.605
SMILES:
Cc1ccc(NC(=O)c2ccc(cc2)C(=O)Nc2ccccc2N)cc1Nc1ncc(s1)-c1cccnc1
: