Target
Tyrosine-protein kinase ABL1
Ligand
BDBM50257077
Substrate
Meas. Tech.
ChEMBL_562750 (CHEMBL1022422)
IC50
34000±n/a nM
Citation
 Mahboobi, SDove, SSellmer, AWinkler, MEichhorn, EPongratz, HCiossek, TBaer, TMaier, TBeckers, T Design of chimeric histone deacetylase- and tyrosine kinase-inhibitors: a series of imatinib hybrides as potent inhibitors of wild-type and mutant BCR-ABL, PDGF-Rbeta, and histone deacetylases. J Med Chem 52:2265-79 (2009)  
Target
Name:
Tyrosine-protein kinase ABL1
Synonyms:
ABL ABL1_HUMAN JTK7 Proto-oncogene tyrosine-protein kinase ABL1 Tyrosine-protein kinase ABL V-abl Abelson murine leukemia viral oncogene homolog 1 p150 | tyrosine-protein kinase ABL1 isoform a
Type:
Enzyme
Mol. Mass.:
122897.30
Organism:
Homo sapiens (Human)
Description:
P00519
Residue:
1130
  
Inhibitor
Name:
BDBM50257077
Synonyms:
CHEMBL515432 | N1-(2-aminophenyl)-N4-(4-methyl-3-(4-(pyridin-3-yl)thiazol-2-ylamino)phenyl)terephthalamide
Type:
Small organic molecule
Emp. Form.:
C29H24N6O2S
Mol. Mass.:
520.605
SMILES:
Cc1ccc(NC(=O)c2ccc(cc2)C(=O)Nc2ccccc2N)cc1Nc1ncc(s1)-c1cccnc1
: