Target
Sodium- and chloride-dependent glycine transporter 1
Ligand
BDBM50277864
Substrate
Meas. Tech.
ChEMBL_501634 (CHEMBL993724)
IC50
10±n/a nM
Citation
 Thomson, JLBlackaby, WPJennings, ASGoodacre, SCPike, AThomas, SBrown, TASmith, APillai, GStreet, LJLewis, RT Optimisation of a series of potent, selective and orally bioavailable GlyT1 inhibitors. Bioorg Med Chem Lett 19:2235-9 (2009)  
Target
Name:
Sodium- and chloride-dependent glycine transporter 1
Synonyms:
GlyT-1 Glycine Transporters (GlyT1c) SC6A9_HUMAN Sodium- and chloride-dependent glycine transporter 1 Sodium- and chloride-dependent glycine transporter 1 (GlyT1c) Solute carrier family 6 member 9
Type:
Enzyme
Mol. Mass.:
78270.54
Organism:
Homo sapiens (Human)
Description:
P48067
Residue:
706
  
Inhibitor
Name:
BDBM50277864
Synonyms:
2,4-dichloro-N-((4-(cyclopropylmethyl)-1-(1-methyl-1H-pyrazol-4-ylsulfonyl)piperidin-4-yl)methyl)benzamide | CHEMBL482974
Type:
Small organic molecule
Emp. Form.:
C21H26Cl2N4O3S
Mol. Mass.:
485.427
SMILES:
Cn1cc(cn1)S(=O)(=O)N1CCC(CNC(=O)c2ccc(Cl)cc2Cl)(CC2CC2)CC1
: