Target
Beta-secretase 1
Ligand
BDBM50267285
Substrate
Meas. Tech.
ChEMBL_563264 (CHEMBL981021)
Ki
0.800000±n/a nM
Citation
 Ghosh, AK Harnessing nature's insight: design of aspartyl protease inhibitors from treatment of drug-resistant HIV to Alzheimer's disease. J Med Chem 52:2163-76 (2009)  
Target
Name:
Beta-secretase 1
Synonyms:
ASP2 Aspartyl protease 2 BACE1 Beta-secretase (BACE) Beta-secretase 1 (BACE 1) Beta-secretase 1 (BACE1) Beta-site amyloid precursor protein cleaving enzyme 1 Memapsin-2 beta-Secretase (BACE-1) | beta-Secretase (BACE1)
Type:
Protein
Mol. Mass.:
55755.10
Organism:
Homo sapiens (Human)
Description:
P56817
Residue:
501
  
Inhibitor
Name:
BDBM50267285
Synonyms:
CHEMBL445804 | tert-butyl (6S,9R,11S,12S,15S,18S)-11-hydroxy-12-isobutyl-6-isopropyl-2,9,19-trimethyl-15-(2-(methylthio)ethyl)-5,8,14,17-tetraoxo-4,7,13,16-tetraazaicosan-18-ylcarbamate
Type:
Small organic molecule
Emp. Form.:
C34H65N5O7S
Mol. Mass.:
687.974
SMILES:
CSCC[C@H](NC(=O)[C@@H](NC(=O)OC(C)(C)C)C(C)C)C(=O)N[C@@H](CC(C)C)[C@@H](O)C[C@@H](C)C(=O)N[C@@H](C(C)C)C(=O)NCC(C)C
: