Target
Mitogen-activated protein kinase 8
Ligand
BDBM50277835
Substrate
Meas. Tech.
ChEMBL_501722 (CHEMBL985050)
Ki
2060±n/a nM
Citation
 Humphries, PSLafontaine, JAAgree, CSAlexander, DChen, PDo, QQLi, LYLunney, EARajapakse, RJSiegel, KTimofeevski, SLWang, TWilhite, DM Synthesis and SAR of 4-substituted-2-aminopyrimidines as novel c-Jun N-terminal kinase (JNK) inhibitors. Bioorg Med Chem Lett 19:2099-102 (2009)  
Target
Name:
Mitogen-activated protein kinase 8
Synonyms:
JNK-46 JNK1-alpha-1 MK08_HUMAN PRKM8 SAPK1C c-Jun N-terminal kinase 1 c-Jun N-terminal kinase 1(JNK1) | c-Jun N-terminal kinase 2 (JNK2)
Type:
Enzyme
Mol. Mass.:
48297.57
Organism:
Homo sapiens (Human)
Description:
JNK-1 was purchased from Upstate Cell Signaling Solutions (formerly Upstate Biotechnology).
Residue:
427
  
Inhibitor
Name:
BDBM50277835
Synonyms:
4-methylpyrimidine-2-thiol | CHEMBL455772
Type:
Small organic molecule
Emp. Form.:
C5H6N2S
Mol. Mass.:
126.18
SMILES:
Cc1ccnc(=S)[nH]1
: