Target
Mitogen-activated protein kinase 8
Ligand
BDBM50277908
Substrate
Meas. Tech.
ChEMBL_501722 (CHEMBL985050)
Ki
162±n/a nM
Citation
 Humphries, PSLafontaine, JAAgree, CSAlexander, DChen, PDo, QQLi, LYLunney, EARajapakse, RJSiegel, KTimofeevski, SLWang, TWilhite, DM Synthesis and SAR of 4-substituted-2-aminopyrimidines as novel c-Jun N-terminal kinase (JNK) inhibitors. Bioorg Med Chem Lett 19:2099-102 (2009)  
Target
Name:
Mitogen-activated protein kinase 8
Synonyms:
JNK-46 JNK1-alpha-1 MK08_HUMAN PRKM8 SAPK1C c-Jun N-terminal kinase 1 c-Jun N-terminal kinase 1(JNK1) | c-Jun N-terminal kinase 2 (JNK2)
Type:
Enzyme
Mol. Mass.:
48297.57
Organism:
Homo sapiens (Human)
Description:
JNK-1 was purchased from Upstate Cell Signaling Solutions (formerly Upstate Biotechnology).
Residue:
427
  
Inhibitor
Name:
BDBM50277908
Synonyms:
CHEMBL518996 | N-(1-methylpiperidin-4-yl)-4-(3-(6-methylpyridin-3-yl)-1H-pyrazol-4-yl)pyrimidin-2-amine
Type:
Small organic molecule
Emp. Form.:
C19H23N7
Mol. Mass.:
349.4328
SMILES:
CN1CCC(CC1)Nc1nccc(n1)-c1c[nH]nc1-c1ccc(C)nc1
: