Target
Metabotropic glutamate receptor 2
Ligand
BDBM50278054
Substrate
Meas. Tech.
ChEMBL_502279 (CHEMBL983950)
EC50
6360±n/a nM
Citation
 Duplantier, AJEfremov, ICandler, JDoran, ACGanong, AHHaas, JAHanks, ANKraus, KGLazzaro, JTLu, JMaklad, NMcCarthy, SAO'Sullivan, TJRogers, BNSiuciak, JASpracklin, DKZhang, L 3-Benzyl-1,3-oxazolidin-2-ones as mGluR2 positive allosteric modulators: Hit-to lead and lead optimization. Bioorg Med Chem Lett 19:2524-9 (2009)  
Target
Name:
Metabotropic glutamate receptor 2
Synonyms:
GPRC1B GRM2_HUMAN Metabotropic glutamate receptor mGlu2 | metabotropic glutamate 2
Type:
Enzyme
Mol. Mass.:
95584.88
Organism:
Homo sapiens (Human)
Description:
Q14416
Residue:
872
  
Inhibitor
Name:
BDBM50278054
Synonyms:
(R)-3-((2'-((dimethylamino)methyl)biphenyl-4-yl)methyl)-5-methyloxazolidin-2-one | CHEMBL484972
Type:
Small organic molecule
Emp. Form.:
C20H24N2O2
Mol. Mass.:
324.4168
SMILES:
C[C@@H]1CN(Cc2ccc(cc2)-c2ccccc2CN(C)C)C(=O)O1
: