Target
Alpha-1B adrenergic receptor
Ligand
BDBM50267510
Substrate
Meas. Tech.
ChEMBL_563503 (CHEMBL961051)
Ki
>10000±n/a nM
Citation
 Herth, MMKramer, VPiel, MPalner, MRiss, PJKnudsen, GMRösch, F Synthesis and in vitro affinities of various MDL 100907 derivatives as potential 18F-radioligands for 5-HT2A receptor imaging with PET. Bioorg Med Chem 17:2989-3002 (2009)  
Target
Name:
Alpha-1B adrenergic receptor
Synonyms:
ADA1B_HUMAN Adrenergic alpha1B Adrenergic receptor alpha Alpha 1B-adrenoreceptor | Alpha-1B adrenergic receptor
Type:
Enzyme
Mol. Mass.:
56862.13
Organism:
Homo sapiens (Human)
Description:
P35368
Residue:
520
  
Inhibitor
Name:
BDBM50267510
Synonyms:
(3-(2-Fluoroethoxy)-2-methoxyphenyl)-(1-(2-p-toluylphenylethyl)-piperidine-4-yl)-methanol | CHEMBL476839
Type:
Small organic molecule
Emp. Form.:
C24H32FNO3
Mol. Mass.:
401.5142
SMILES:
COc1c(OCCF)cccc1C(O)C1CCN(CCc2ccc(C)cc2)CC1
: