Target
Cannabinoid receptor 1
Ligand
BDBM50267756
Substrate
Meas. Tech.
ChEMBL_563541 (CHEMBL961828)
Ki
3400±n/a nM
Citation
 Brizzi, ABrizzi, VCascio, MGCorelli, FGuida, FLigresti, AMaione, SMartinelli, APasquini, STuccinardi, TDi Marzo, V New resorcinol-anandamide"hybrids" as potent cannabinoid receptor ligands endowed with antinociceptive activity in vivo. J Med Chem 52:2506-14 (2009)  
Target
Name:
Cannabinoid receptor 1
Synonyms:
CANN6 CB-R CNR CNR1_HUMAN Cannabinoid receptor Cannabinoid receptor 1 (brain)
Type:
G Protein-Coupled Receptor (GPCR)
Mol. Mass.:
52868.96
Organism:
Homo sapiens (Human)
Description:
P21554
Residue:
472
  
Inhibitor
Name:
BDBM50267756
Synonyms:
CHEMBL488933 | N-(3,4-dihydroxyphenethyl)-11-(3-hydroxy-5-(2-methyloctan-2-yl)phenoxy)undecanamide
Type:
Small organic molecule
Emp. Form.:
C34H53NO5
Mol. Mass.:
555.7883
SMILES:
CCCCCCC(C)(C)c1cc(O)cc(OCCCCCCCCCCC(=O)NCCc2ccc(O)c(O)c2)c1
: