Target
Beta-3 adrenergic receptor
Ligand
BDBM50259124
Substrate
Meas. Tech.
ChEMBL_498900 (CHEMBL972494)
EC50
>100000±n/a nM
Citation
 Maruyama, TOnda, KHayakawa, MSeki, NTakahashi, TMoritomo, HSuzuki, TMatsui, TTakasu, TNagase, IOhta, M Synthesis and evaluation of novel phenoxypropanolamine derivatives containing acetanilides as potent and selective beta3-adrenergic receptor agonists. Bioorg Med Chem 17:3283-94 (2009)  
Target
Name:
Beta-3 adrenergic receptor
Synonyms:
ADRB3 ADRB3_HUMAN Beta-2 adrenergic receptor and beta-3 adrenergic receptor Beta-3 adrenoreceptor | adrenergic Beta3
Type:
G Protein-Coupled Receptor (GPCR)
Mol. Mass.:
43534.88
Organism:
Homo sapiens (Human)
Description:
Residue:
408
  
Inhibitor
Name:
BDBM50259124
Synonyms:
(S)-4'-(2-{[2-Hydroxy-3-(carbazol-4-yloxy)propyl]-amino}ethyl)-2-(2-pyridyl)acetanilide | CHEMBL466704
Type:
Small organic molecule
Emp. Form.:
C26H28N4O3
Mol. Mass.:
444.5255
SMILES:
O[C@@H](CNCCc1ccc(NC(=O)Cc2ccccn2)cc1)COc1cccc2[nH]ccc12
: