Target
DNA topoisomerase 2-alpha
Ligand
BDBM87351
Substrate
Meas. Tech.
ChEMBL_499143 (CHEMBL1011417)
IC50
9940±n/a nM
Citation
 Loza-Mejía, MAOlvera-Vázquez, SMaldonado-Hernández, KGuadarrama-Salgado, TGonzález-Sánchez, IRodríguez-Hernández, FSolano, JDRodríguez-Sotres, RLira-Rocha, A Synthesis, cytotoxic activity, DNA topoisomerase-II inhibition, molecular modeling and structure-activity relationship of 9-anilinothiazolo[5,4-b]quinoline derivatives. Bioorg Med Chem 17:3266-77 (2009)  
Target
Name:
DNA topoisomerase 2-alpha
Synonyms:
DNA topoisomerase 2-alpha DNA topoisomerase II (Topo II) DNA topoisomerase II, alpha isozyme TOP2A Topoisomerase I/II | Topoisomerase II alpha (HuTopoIIα)
Type:
Protein
Mol. Mass.:
174415.30
Organism:
Homo sapiens (Human)
Description:
P11388
Residue:
1531
  
Inhibitor
Name:
BDBM87351
Synonyms:
Amsacrine hydrochloride MLS002153376 N-[4-(acridin-9-ylamino)-3-methoxy-phenyl]methanesulfonamide;hydrochloride N-[4-(acridin-9-ylamino)-3-methoxyphenyl]methanesulfonamide;hydrochloride cid_148673 | m-AMSA
Type:
Small organic molecule
Emp. Form.:
C21H19N3O3S
Mol. Mass.:
393.459
SMILES:
COc1cc(NS(C)(=O)=O)ccc1Nc1c2ccccc2nc2ccccc12
: