Target
Elongation of very long chain fatty acids protein 6
Ligand
BDBM50249892
Substrate
Meas. Tech.
ChEMBL_498144 (CHEMBL1007916)
IC50
8.9±n/a nM
Citation
 Takahashi, TNagase, TSasaki, TNagumo, AShimamura, KMiyamoto, YKitazawa, HKanesaka, MYoshimoto, RAragane, KTokita, SSato, N Synthesis and evaluation of a novel indoledione class of long chain fatty acid elongase 6 (ELOVL6) inhibitors. J Med Chem 52:3142-5 (2009)  
Target
Name:
Elongation of very long chain fatty acids protein 6
Synonyms:
ELOV6_HUMAN FACE | LCE
Type:
PROTEIN
Mol. Mass.:
31392.28
Organism:
Homo sapiens (Human)
Description:
ChEMBL_572238
Residue:
265
  
Inhibitor
Name:
BDBM50249892
Synonyms:
6,6-dimethyl-3-{5-methyl-3-oxo-2-[4-(trifluoromethoxy)phenyl]-2,3-dihydro-1H-pyrazol-4-yl}-1-phenyl-3-(trifluoromethyl)-3,5,6,7-tetrahydro-1H-indole-2,4-dione | CHEMBL449121
Type:
Small organic molecule
Emp. Form.:
C28H23F6N3O4
Mol. Mass.:
579.4903
SMILES:
Cc1[nH]n(-c2ccc(OC(F)(F)F)cc2)c(=O)c1C1(C(=O)N(C2=C1C(=O)CC(C)(C)C2)c1ccccc1)C(F)(F)F
: