Target
Alpha-1A adrenergic receptor
Ligand
BDBM50259381
Substrate
Meas. Tech.
ChEMBL_499389 (CHEMBL1015841)
EC50
>10000±n/a nM
Citation
 Whitlock, GABrennan, PERoberts, LRStobie, A Potent and selective alpha1A adrenoceptor partial agonists--novel imidazole frameworks. Bioorg Med Chem Lett 19:3118-21 (2009)  
Target
Name:
Alpha-1A adrenergic receptor
Synonyms:
ADA1A_HUMAN ADRA1C Alpha 1A-adrenoceptor Alpha adrenergic receptor 1a Alpha-adrenergic receptor 1c adrenergic Alpha1 | adrenergic Alpha1C
Type:
Cell-surface receptors
Mol. Mass.:
51511.67
Organism:
Homo sapiens (Human)
Description:
P35348
Residue:
466
  
Inhibitor
Name:
BDBM50259381
Synonyms:
6-phenyl-6,7-di hydro-5H-pyrrolo[1,2-a]imidazole CHEMBL465963
Type:
Small organic molecule
Emp. Form.:
C12H12N2
Mol. Mass.:
184.2371
SMILES:
C1C(Cn2ccnc12)c1ccccc1
: