Target
Tyrosine-protein kinase JAK3
Ligand
BDBM50258424
Substrate
Meas. Tech.
ChEMBL_500024 (CHEMBL1025472)
Ki
2300±n/a nM
Citation
 Grey, RPierce, ACBemis, GWJacobs, MDMoody, CSJajoo, RMohal, NGreen, J Structure-based design of 3-aryl-6-amino-triazolo[4,3-b]pyridazine inhibitors of Pim-1 kinase. Bioorg Med Chem Lett 19:3019-22 (2009)  
Target
Name:
Tyrosine-protein kinase JAK3
Synonyms:
JAK-3 JAK3_HUMAN Janus kinase 3 (JAK3) L-JAK | Leukocyte janus kinase
Type:
Protein
Mol. Mass.:
125111.08
Organism:
Homo sapiens (Human)
Description:
P52333
Residue:
1124
  
Inhibitor
Name:
BDBM50258424
Synonyms:
CHEMBL494221 | trans-4-(3-(3-(trifluoromethyl)phenyl)-[1,2,4]triazolo[4,3-b]pyridazin-6-ylamino)cyclohexanol
Type:
Small organic molecule
Emp. Form.:
C18H18F3N5O
Mol. Mass.:
377.3636
SMILES:
O[C@H]1CC[C@@H](CC1)Nc1ccc2nnc(-c3cccc(c3)C(F)(F)F)n2n1
: