Target
Glycogen synthase kinase-3 beta
Ligand
BDBM50258424
Substrate
Meas. Tech.
ChEMBL_500020 (CHEMBL970458)
Ki
230±n/a nM
Citation
 Grey, RPierce, ACBemis, GWJacobs, MDMoody, CSJajoo, RMohal, NGreen, J Structure-based design of 3-aryl-6-amino-triazolo[4,3-b]pyridazine inhibitors of Pim-1 kinase. Bioorg Med Chem Lett 19:3019-22 (2009)  
Target
Name:
Glycogen synthase kinase-3 beta
Synonyms:
GSK-3 beta GSK3B Glycogen synthase kinase 3 beta (GSK3B) Glycogen synthase kinase-3 beta (GSK-3B) Glycogen synthase kinase-3 beta (GSK3B) Glycogen synthase kinase-3beta (GSK3B) | Serine/threonine-protein kinase GSK3B
Type:
Enzyme
Mol. Mass.:
46756.38
Organism:
Homo sapiens (Human)
Description:
P49841
Residue:
420
  
Inhibitor
Name:
BDBM50258424
Synonyms:
CHEMBL494221 | trans-4-(3-(3-(trifluoromethyl)phenyl)-[1,2,4]triazolo[4,3-b]pyridazin-6-ylamino)cyclohexanol
Type:
Small organic molecule
Emp. Form.:
C18H18F3N5O
Mol. Mass.:
377.3636
SMILES:
O[C@H]1CC[C@@H](CC1)Nc1ccc2nnc(-c3cccc(c3)C(F)(F)F)n2n1
: