Target
Androgen receptor
Ligand
BDBM18522
Substrate
Meas. Tech.
ChEMBL_523646 (CHEMBL998017)
Ki
1.5±n/a nM
Citation
 Mohler, MLBohl, CEJones, ACoss, CCNarayanan, RHe, YHwang, DJDalton, JTMiller, DD Nonsteroidal selective androgen receptor modulators (SARMs): dissociating the anabolic and androgenic activities of the androgen receptor for therapeutic benefit. J Med Chem 52:3597-617 (2009)  
Target
Name:
Androgen receptor
Synonyms:
ANDR_HUMAN Androgen Receptor Androgen receptor/Baculoviral IAP repeat-containing protein 2 Dihydrotestosterone receptor Nuclear receptor subfamily 3 group C member 4
Type:
Receptor
Mol. Mass.:
99185.27
Organism:
Homo sapiens (Human)
Description:
CHO cells were stably transfected with human AR gene.
Residue:
920
  
Inhibitor
Name:
BDBM18522
Synonyms:
6-(1-Pyrrolidine)quinolin-2(1H)-one, 6a CHEMBL467888 | LGD2941
Type:
Small organic molecule
Emp. Form.:
C17H16F6N2O2
Mol. Mass.:
394.3116
SMILES:
C[C@@H]1CC[C@H]([C@@H](O)C(F)(F)F)N1c1ccc2[nH]c(=O)cc(c2c1)C(F)(F)F
: