Target
Metabotropic glutamate receptor 5
Ligand
BDBM50122758
Substrate
Meas. Tech.
ChEMBL_523080 (CHEMBL1004110)
IC50
14±n/a nM
Citation
 Kulkarni, SSZou, MFCao, JDeschamps, JRRodriguez, ALConn, PJNewman, AH Structure-activity relationships comparing N-(6-methylpyridin-yl)-substituted aryl amides to 2-methyl-6-(substituted-arylethynyl)pyridines or 2-methyl-4-(substituted-arylethynyl)thiazoles as novel metabotropic glutamate receptor subtype 5 antagonists. J Med Chem 52:3563-75 (2009)  
Target
Name:
Metabotropic glutamate receptor 5
Synonyms:
GRM5_RAT Grm5 Mglur5 metabotropic glutamate 5/1-C metabotropic glutamate 5a
Type:
Enzyme
Mol. Mass.:
131900.14
Organism:
Rattus norvegicus (Rat)
Description:
P31424
Residue:
1203
  
Inhibitor
Name:
BDBM50122758
Synonyms:
2-methyl-4-(pyridin-3-ylethynyl)thiazole 3-(2-Methyl-thiazol-4-ylethynyl)-pyridine 3-[(2-methyl-4-thiazolyl)ethynyl]pyridine MTEP
Type:
Small organic molecule
Emp. Form.:
C11H8N2S
Mol. Mass.:
200.26
SMILES:
Cc1nc(cs1)C#Cc1cccnc1
: