Target
Metabotropic glutamate receptor 5
Ligand
BDBM50258615
Substrate
Meas. Tech.
ChEMBL_523078 (CHEMBL1004108)
Ki
>10000±n/a nM
Citation
 Kulkarni, SSZou, MFCao, JDeschamps, JRRodriguez, ALConn, PJNewman, AH Structure-activity relationships comparing N-(6-methylpyridin-yl)-substituted aryl amides to 2-methyl-6-(substituted-arylethynyl)pyridines or 2-methyl-4-(substituted-arylethynyl)thiazoles as novel metabotropic glutamate receptor subtype 5 antagonists. J Med Chem 52:3563-75 (2009)  
Target
Name:
Metabotropic glutamate receptor 5
Synonyms:
GPRC1E GRM5_HUMAN metabotropic glutamate 5 | metabotropic glutamate 5a
Type:
Enzyme
Mol. Mass.:
132484.72
Organism:
Homo sapiens (Human)
Description:
Residue:
1212
  
Inhibitor
Name:
BDBM50258615
Synonyms:
4-(3'-Cyano-phenyl)-N-(6-methylpyridin-2-yl)-benzamide | CHEMBL512634
Type:
Small organic molecule
Emp. Form.:
C20H15N3O
Mol. Mass.:
313.3526
SMILES:
Cc1cccc(NC(=O)c2ccc(cc2)-c2cccc(c2)C#N)n1
: