Target
Cytochrome P450 2D6
Ligand
BDBM50268742
Substrate
Meas. Tech.
ChEMBL_519906 (CHEMBL964395)
IC50
1100±n/a nM
Citation
 Bailey, NBamford, MJBrissy, DBrookfield, JDemont, EElliott, RGarton, NFarre-Gutierrez, IHayhow, THutley, GNaylor, APanchal, TASeow, HXSpalding, DTakle, AK Orally active C-6 heteroaryl- and heterocyclyl-substituted imidazo[1,2-a]pyridine acid pump antagonists (APAs). Bioorg Med Chem Lett 19:3602-6 (2009)  
Target
Name:
Cytochrome P450 2D6
Synonyms:
CP2D6_HUMAN CYP2DL1 Cytochrome P450 2D6 (CYP2D6) P450-DB1
Type:
Protein
Mol. Mass.:
55774.82
Organism:
Homo sapiens (Human)
Description:
P10635
Residue:
497
  
Inhibitor
Name:
BDBM50268742
Synonyms:
CHEMBL523752 | N-(2-ethyl-6-methylbenzyl)-2,3-dimethylimidazo[1,2-a]pyridin-8-amine
Type:
Small organic molecule
Emp. Form.:
C19H23N3
Mol. Mass.:
293.406
SMILES:
CCc1cccc(C)c1CNc1cccn2c(C)c(C)nc12
: