Target
Cytochrome P450 2C9
Ligand
BDBM50268781
Substrate
Meas. Tech.
ChEMBL_519904 (CHEMBL964393)
IC50
17000±n/a nM
Citation
 Bailey, NBamford, MJBrissy, DBrookfield, JDemont, EElliott, RGarton, NFarre-Gutierrez, IHayhow, THutley, GNaylor, APanchal, TASeow, HXSpalding, DTakle, AK Orally active C-6 heteroaryl- and heterocyclyl-substituted imidazo[1,2-a]pyridine acid pump antagonists (APAs). Bioorg Med Chem Lett 19:3602-6 (2009)  
Target
Name:
Cytochrome P450 2C9
Synonyms:
(R)-limonene 6-monooxygenase CP2C9_HUMAN CYP2C9 Cytochrome P450 2C9 (CYP2C9 ) P-450MP P450 PB-1 | S-mephenytoin 4-hydroxylase
Type:
Enzyme
Mol. Mass.:
55636.33
Organism:
Homo sapiens (Human)
Description:
P11712
Residue:
490
  
Inhibitor
Name:
BDBM50268781
Synonyms:
1-(8-(2,6-dimethylbenzylamino)-2,3-dimethylimidazo[1,2-a]pyridin-6-yl)pyridin-2(1H)-one | CHEMBL496605
Type:
Small organic molecule
Emp. Form.:
C23H24N4O
Mol. Mass.:
372.4629
SMILES:
Cc1nc2c(NCc3c(C)cccc3C)cc(cn2c1C)-n1ccccc1=O
: