Target
Cytochrome P450 3A4
Ligand
BDBM50269110
Substrate
Meas. Tech.
ChEMBL_519907 (CHEMBL964396)
IC50
10000±n/a nM
Citation
 Bailey, NBamford, MJBrissy, DBrookfield, JDemont, EElliott, RGarton, NFarre-Gutierrez, IHayhow, THutley, GNaylor, APanchal, TASeow, HXSpalding, DTakle, AK Orally active C-6 heteroaryl- and heterocyclyl-substituted imidazo[1,2-a]pyridine acid pump antagonists (APAs). Bioorg Med Chem Lett 19:3602-6 (2009)  
Target
Name:
Cytochrome P450 3A4
Synonyms:
Albendazole monooxygenase CP3A4_HUMAN CYP3A4 CYPIIIA4 Cytochrome P450 3A4 (CYP3A4) Nifedipine oxidase Taurochenodeoxycholate 6-alpha-hydroxylase
Type:
Enzyme
Mol. Mass.:
57349.57
Organism:
Homo sapiens (Human)
Description:
Residue:
503
  
Inhibitor
Name:
BDBM50269110
Synonyms:
1-(8-(2,6-dimethylphenethyl)-2,3-dimethylimidazo[1,2-a]pyridin-6-yl)pyridin-2(1H)-one | CHEMBL498114
Type:
Small organic molecule
Emp. Form.:
C24H25N3O
Mol. Mass.:
371.4748
SMILES:
Cc1nc2c(CCc3c(C)cccc3C)cc(cn2c1C)-n1ccccc1=O
: