Target
Cytochrome P450 2D6
Ligand
BDBM50268442
Substrate
Meas. Tech.
ChEMBL_523919 (CHEMBL1001512)
IC50
>10000±n/a nM
Citation
 Shen, HCDing, FXWang, SXu, SChen, HSTong, XTong, VMitra, KKumar, SZhang, XChen, YZhou, GPai, LYAlonso-Galicia, MChen, XZhang, BTata, JRBerger, JPColletti, SL Discovery of spirocyclic secondary amine-derived tertiary ureas as highly potent, selective and bioavailable soluble epoxide hydrolase inhibitors. Bioorg Med Chem Lett 19:3398-404 (2009)  
Target
Name:
Cytochrome P450 2D6
Synonyms:
CP2D6_HUMAN CYP2DL1 Cytochrome P450 2D6 (CYP2D6) P450-DB1
Type:
Protein
Mol. Mass.:
55774.82
Organism:
Homo sapiens (Human)
Description:
P10635
Residue:
497
  
Inhibitor
Name:
BDBM50268442
Synonyms:
(+/-)-4-oxo-N-(1,2,3,4-tetrahydronaphthalen-2-yl)spiro[chroman-2,4'-piperidine]-1'-carboxamide | CHEMBL495601
Type:
Small organic molecule
Emp. Form.:
C24H26N2O3
Mol. Mass.:
390.4748
SMILES:
O=C(NC1CCc2ccccc2C1)N1CCC2(CC1)CC(=O)c1ccccc1O2
: