Target
Neuronal acetylcholine receptor subunit alpha-7
Ligand
BDBM50279242
Substrate
Meas. Tech.
ChEMBL_546016 (CHEMBL1028494)
Ki
13000±n/a nM
Citation
 Tasso, BCanu Boido, CTerranova, EGotti, CRiganti, LClementi, FArtali, RBombieri, GMeneghetti, FSparatore, F Synthesis, binding, and modeling studies of new cytisine derivatives, as ligands for neuronal nicotinic acetylcholine receptor subtypes. J Med Chem 52:4345-57 (2009)  
Target
Name:
Neuronal acetylcholine receptor subunit alpha-7
Synonyms:
ACHA7_RAT Cholinergic, Nicotinic Alpha7 Chrna7 Neuronal acetylcholine receptor (alpha7 nAChR) Neuronal acetylcholine receptor subunit alpha-7 Neuronal acetylcholine receptor subunit alpha-7 (nAChR)
Type:
Enzyme
Mol. Mass.:
56502.44
Organism:
Rattus norvegicus (Rat)
Description:
Q05941
Residue:
502
  
Inhibitor
Name:
BDBM50279242
Synonyms:
(1R,5S)-3-(3-Phenyl-propyl)-1,2,3,4,5,6-hexahydro-1,5-methano-pyrido[1,2-a][1,5]diazocin-8-one | CHEMBL500426
Type:
Small organic molecule
Emp. Form.:
C20H24N2O
Mol. Mass.:
308.4174
SMILES:
O=c1cccc2[C@@H]3C[C@@H](CN(CCCc4ccccc4)C3)Cn12
: