Target
Tyrosine-protein kinase Lck
Ligand
BDBM50279898
Substrate
Meas. Tech.
ChEBML_210745
IC50
1318000±n/a nM
Citation
 Cushman, MNagarathnam, DGopal, DGeahlen, RL Synthesis and evaluation of new protein-tyrosine kinase inhibitors. Part 2. Phenylhydrazones. Bioorg Med Chem Lett 1:215-218 (1991)    Article 
Target
Name:
Tyrosine-protein kinase Lck
Synonyms:
2.7.10.2 LCK_HUMAN Leukocyte C-terminal Src kinase Lymphocyte-specific protein tyrosine kinase Protein YT16 Proto-oncogene tyrosine-protein kinase LCK T cell-specific protein-tyrosine kinase
Type:
Mol. Mass.:
57987.83
Organism:
Homo sapiens (Human)
Description:
P06239
Residue:
509
  
Inhibitor
Name:
BDBM50279898
Synonyms:
CHEMBL62881 | N-Phenyl-N'-[1-pyridin-3-yl-meth-(E)-ylidene]-hydrazine
Type:
Small organic molecule
Emp. Form.:
C12H11N3
Mol. Mass.:
197.2358
SMILES:
C(N=Nc1ccccc1)c1cccnc1
: