Target
Thromboxane-A synthase
Ligand
BDBM50280719
Substrate
Meas. Tech.
ChEBML_210276
IC50
50±n/a nM
Citation
 Russell, KGaskin, HJessup, R Discovery of dual activity molecules with thromboxane antagonist and thromboxane synthase inhibitory activity Bioorg Med Chem Lett 2:979-984 (1992)    Article 
Target
Name:
Thromboxane-A synthase
Synonyms:
CYP5 Cytochrome P450 5A1 TBXAS1 TXA synthase TXS Thromboxane A2 Synthase (P450 TxA2) Thromboxane prostanoid Thromboxane-A synthase
Type:
Enzyme
Mol. Mass.:
60524.67
Organism:
Homo sapiens (Human)
Description:
P24557
Residue:
533
  
Inhibitor
Name:
BDBM50280719
Synonyms:
CHEMBL175538 | {6-Fluoro-9-[3-(5-pyridin-3-yl-pent-4-ynyloxy)-benzyl]-2,3,4,9-tetrahydro-1H-carbazol-1-yl}-acetic acid
Type:
Small organic molecule
Emp. Form.:
C31H29FN2O3
Mol. Mass.:
496.572
SMILES:
OC(=O)CC1CCCc2c1n(Cc1cccc(OCCCC#Cc3cccnc3)c1)c1ccc(F)cc21
: