Target
Glutamate receptor ionotropic, NMDA 2C
Ligand
BDBM50007674
Substrate
Meas. Tech.
ChEBML_140488
IC50
263±n/a nM
Citation
 Chenard, BLButler, TWShalaby, IAProchniak, MAKoe, BKFox, CB Oxindole N-Methyl-D-Aspartate (NMDA) antagonists Bioorg Med Chem Lett 3:91-94 (1993)    Article 
Target
Name:
Glutamate receptor ionotropic, NMDA 2C
Synonyms:
Glutamate NMDA receptor; Grin1/Grin2c Grin2c NMDE3_RAT
Type:
Protein
Mol. Mass.:
135305.94
Organism:
Rattus norvegicus (Rat)
Description:
Q00961
Residue:
1237
  
Inhibitor
Name:
BDBM50007674
Synonyms:
(+)-erythro 4-[2-(4-Benzyl-piperidin-1-yl)-1-hydroxy-propyl]-phenol 4-[(1R,2S)-2-(4-Benzyl-piperidin-1-yl)-1-hydroxy-propyl]-phenol 4-[2-(4-Benzyl-piperidin-1-yl)-1-hydroxy-propyl]-phenol Ifenprodil | Ifenprodil,(+/-)
Type:
Small organic molecule
Emp. Form.:
C21H27NO2
Mol. Mass.:
325.4446
SMILES:
C[C@@H]([C@H](O)c1ccc(O)cc1)N1CCC(Cc2ccccc2)CC1
: