Target
Glutamate receptor ionotropic, NMDA 2C
Ligand
BDBM50280813
Substrate
Meas. Tech.
ChEBML_140488
IC50
40±n/a nM
Citation
 Chenard, BLButler, TWShalaby, IAProchniak, MAKoe, BKFox, CB Oxindole N-Methyl-D-Aspartate (NMDA) antagonists Bioorg Med Chem Lett 3:91-94 (1993)    Article 
Target
Name:
Glutamate receptor ionotropic, NMDA 2C
Synonyms:
Glutamate NMDA receptor; Grin1/Grin2c Grin2c NMDE3_RAT
Type:
Protein
Mol. Mass.:
135305.94
Organism:
Rattus norvegicus (Rat)
Description:
Q00961
Residue:
1237
  
Inhibitor
Name:
BDBM50280813
Synonyms:
5-[(1S,2S)-1-Hydroxy-2-(4-phenyl-piperidin-1-yl)-propyl]-1,3-dihydro-indol-2-one | CHEMBL366809
Type:
Small organic molecule
Emp. Form.:
C22H26N2O2
Mol. Mass.:
350.454
SMILES:
C[C@@H]([C@@H](O)c1ccc2NC(=O)Cc2c1)N1CCC(CC1)c1ccccc1
: