Target
Gastrin/cholecystokinin type B receptor
Ligand
BDBM50092394
Substrate
Meas. Tech.
ChEBML_48761
IC50
3.3±n/a nM
Citation
 Boteju, LWZalewska, TYamamura, HIHruby, VJ Tryptophan-norleucine 1,5-disubstituted tetrazoles as cis peptide bond mimics: Investigation of the bioactive conformation of a potent and selective peptide for the cholecystokinin-B receptor Bioorg Med Chem Lett 3:2011-2016 (1993)    Article 
Target
Name:
Gastrin/cholecystokinin type B receptor
Synonyms:
CCK-2 receptor CCK-BR CCKRB Cholecystokinin receptor GASR_HUMAN | Gastrin/cholecystokinin type B receptor
Type:
G Protein-Coupled Receptor (GPCR)
Mol. Mass.:
48445.79
Organism:
Homo sapiens (Human)
Description:
Stable expression of human CCK-2 receptors in HEK 293 cells.
Residue:
447
  
Inhibitor
Name:
BDBM50092394
Synonyms:
(S)-3-((S)-2-{[(S)-2-(2-Amino-acetylamino)-3-(S)-1H-indol-3-yl-propionyl]-methyl-amino}-hexanoylamino)-N-(1-carbamoyl-2-phenyl-ethyl)-succinamic acid CHEMBL59865
Type:
Small organic molecule
Emp. Form.:
C33H43N7O7
Mol. Mass.:
649.7372
SMILES:
CCCC[C@H](N(C)C(=O)[C@H](Cc1c[nH]c2ccccc12)NC(=O)CN)C(=O)N[C@@H](CC(O)=O)C(=O)N[C@@H](Cc1ccccc1)C(N)=O
: