Target
Renin
Ligand
BDBM50281231
Substrate
Meas. Tech.
ChEBML_196101
pH
7±n/a
IC50
1.7±n/a nM
Comments
extracted
Citation
 Poss, MAReid, JAFree, CARogers, WWeber, HRyono, DEDejneka, TDeForrest, JMWaldron, TLBrittain, RJWeller, HNCimarusti, MPPetrillo, EW Diol sulfonamides: A potent and novel class of inhibitors of human renin Bioorg Med Chem Lett 3:2739-2744 (1993)    Article 
Target
Name:
Renin
Synonyms:
Angiotensinogenase RENI_HUMAN
Type:
Enzyme
Mol. Mass.:
45058.99
Organism:
Homo sapiens (Human)
Description:
Residue:
406
  
Inhibitor
Name:
BDBM50281231
Synonyms:
(S)-4-Methyl-2-[(S)-2-(2-methyl-propane-2-sulfonylmethyl)-3-phenyl-propionylamino]-pentanoic acid [(2R,3S)-4-((R)-butylsulfamoyl)-1-cyclohexylmethyl-2,3-dihydroxy-butyl]-amide | CHEMBL328238
Type:
Small organic molecule
Emp. Form.:
C35H61N3O8S2
Mol. Mass.:
716.004
SMILES:
CCCCNS(=O)(=O)C[C@H](O)[C@H](O)[C@H](CC1CCCCC1)NC(=O)[C@H](CC(C)C)NC(=O)[C@H](Cc1ccccc1)CS(=O)(=O)C(C)(C)C
: