Target
Angiotensin-converting enzyme
Ligand
BDBM50281463
Substrate
Meas. Tech.
ChEBML_34935
Ki
350±n/a nM
Citation
 L.Boger, DYohannes, D K-13 and of4949: Evaluation of key partial structures and pharmacophore delineation Bioorg Med Chem Lett 3:245-250 (1993)    Article 
Target
Name:
Angiotensin-converting enzyme
Synonyms:
3.2.1.- ACE Angiotensin-converting enzyme, soluble form DCP1 Kininase II
Type:
Mol. Mass.:
150405.15
Organism:
Oryctolagus cuniculus
Description:
Residue:
1310
  
Inhibitor
Name:
BDBM50281463
Synonyms:
(9R,12S,15R)-15-Acetylamino-4-hydroxy-12-(4-hydroxy-benzyl)-11,14-dioxo-2-oxa-10,13-diaza-tricyclo[15.2.2.1*3,7*]docosa-1(20),3,5,7(22),17(21),18-hexaene-9-carboxylic acid | CHEMBL85928
Type:
Small organic molecule
Emp. Form.:
C29H29N3O8
Mol. Mass.:
547.5559
SMILES:
CC(=O)N[C@@H]1Cc2ccc(Oc3cc(C[C@@H](NC(=O)[C@H](Cc4ccc(O)cc4)NC1=O)C(O)=O)ccc3O)cc2
: