Target
Gastrin/cholecystokinin type B receptor
Ligand
BDBM50007446
Substrate
Meas. Tech.
ChEBML_48269
IC50
4.2±n/a nM
Citation
 Higginbottom, MHorwell, DCRoberts, E Selective ligands for cholecystokinin receptor subtypes CCK-A and CCK-B within a single structural class Bioorg Med Chem Lett 3:881-884 (1993)    Article 
Target
Name:
Gastrin/cholecystokinin type B receptor
Synonyms:
Cckbr Cholecystokinin receptor Gastrin/cholecystokinin type B receptor
Type:
Enzyme Catalytic Domain
Mol. Mass.:
49196.59
Organism:
MOUSE
Description:
Cholecystokinin A CCKBR MOUSE::P56481
Residue:
453
  
Inhibitor
Name:
BDBM50007446
Synonyms:
CHEMBL335914 | N-{2-[2-(Adamantan-2-yloxycarbonylamino)-3-(1H-indol-3-yl)-2-methyl-propionylamino]-3-phenyl-propyl}-succinamic acid
Type:
Small organic molecule
Emp. Form.:
C36H44N4O6
Mol. Mass.:
628.7578
SMILES:
C[C@](Cc1c[nH]c2ccccc12)(NC(=O)OC1[C@H]2C[C@@H]3C[C@@H](C[C@H]1C3)C2)C(=O)N[C@H](CNC(=O)CCC(O)=O)Cc1ccccc1
: