Target
Thymidine kinase, cytosolic
Ligand
BDBM50282072
Substrate
Meas. Tech.
ChEMBL_208022 (CHEMBL882138)
Ki
26000±n/a nM
Citation
 Kim, CUMisco, PFLuh, BYTerry, BBisacchi, GMansuri, MM (2R, 4S, 5S)-1-(tetrahydro-4-hydroxy-5-methoxy-2-furanyl)thymine: a potent selective inhibitor of herpes simplex thymidine kinase Bioorg Med Chem Lett 3:1571-1576 (1993)    Article 
Target
Name:
Thymidine kinase, cytosolic
Synonyms:
KITH_HUMAN | TK1
Type:
PROTEIN
Mol. Mass.:
25476.50
Organism:
Homo sapiens (Human)
Description:
ChEMBL_1333884
Residue:
234
  
Inhibitor
Name:
BDBM50282072
Synonyms:
1-((2R,4S,5S)-4-Hydroxy-5-phenethyloxy-tetrahydro-furan-2-yl)-5-methyl-1H-pyrimidine-2,4-dione | CHEMBL289626
Type:
Small organic molecule
Emp. Form.:
C17H20N2O5
Mol. Mass.:
332.3511
SMILES:
Cc1cn([C@H]2C[C@H](O)[C@@H](OCCc3ccccc3)O2)c(=O)[nH]c1=O
: