Target
Thromboxane A2 receptor
Ligand
BDBM50002765
Substrate
Meas. Tech.
ChEBML_210120
IC50
1500±n/a nM
Citation
 Yokota, MImamaki, KUchibori, SKondo, MKosakai, KTomiyama, T Role of sulfonamide moiety in non-prostanoid txa2 receptor antagonist kt2-962 : modifications of this moiety and the resulting activities Bioorg Med Chem Lett 3:1687-1692 (1993)    Article 
Target
Name:
Thromboxane A2 receptor
Synonyms:
TA2R_RAT Tbxa2r | Thromboxane A2
Type:
Enzyme Catalytic Domain
Mol. Mass.:
36943.05
Organism:
RAT
Description:
Thromboxane A2 TBXA2R RAT::P34978
Residue:
341
  
Inhibitor
Name:
BDBM50002765
Synonyms:
BM 13177 CHEMBL8273 [4-(2-Benzenesulfonylamino-ethyl)-phenoxy]-acetic acid [4-(2-Benzenesulfonylamino-ethyl)-phenoxy]-acetic acid(sulotroban)
Type:
Small organic molecule
Emp. Form.:
C16H17NO5S
Mol. Mass.:
335.375
SMILES:
OC(=O)COc1ccc(CCNS(=O)(=O)c2ccccc2)cc1
: