Target
Type-1 angiotensin II receptor B
Ligand
BDBM50282261
Substrate
Meas. Tech.
ChEMBL_34825 (CHEMBL648759)
IC50
2.2±n/a nM
Citation
 Bernhart, CAHundricourt, FBAssens, JLGougat, JLacour, CRoccon, ACazaubon, CBrelière, JCFur, GLNisato, D Cyclopentanespiro-3H-dihydro-pyrimidinones as Angiotensin II AT1 receptor antagonists Bioorg Med Chem Lett 4:157-162 (1994)    Article 
Target
Name:
Type-1 angiotensin II receptor B
Synonyms:
AGTRB_RAT Agtr1 Angiotensin II AT1B Angiotensin II type 1b (AT-1b) receptor Type-1B angiotensin II receptor
Type:
Enzyme Catalytic Domain
Mol. Mass.:
40929.44
Organism:
RAT
Description:
Angiotensin II AT1B 0 RAT::P29089
Residue:
359
  
Inhibitor
Name:
BDBM50282261
Synonyms:
7-Butyl-10,10-dimethyl-8-[2'-(2H-tetrazol-5-yl)-biphenyl-4-ylmethyl]-6,8-diaza-spiro[4.5]dec-6-en-9-one | CHEMBL40251
Type:
Small organic molecule
Emp. Form.:
C28H34N6O
Mol. Mass.:
470.6092
SMILES:
CCCCC1=NC2(CCCC2)C(C)(C)C(=O)N1Cc1ccc(cc1)-c1ccccc1-c1nnn[nH]1
: