Target
Type-1 angiotensin II receptor B
Ligand
BDBM50282271
Substrate
Meas. Tech.
ChEMBL_34830 (CHEMBL648764)
IC50
230±n/a nM
Citation
 Perreaut, PClément, JMuneaux, CMuneaux, YCazaubon, CGougat, JGuiraudou, PLacour, CNisato, DFur, GLBreliere, JC Dihydro-imidazolone derivatives as angiotensin II receptor antagonists: chiral effect on the activity Bioorg Med Chem Lett 4:163-168 (1994)    Article 
Target
Name:
Type-1 angiotensin II receptor B
Synonyms:
AGTRB_RAT Agtr1 Angiotensin II AT1B Angiotensin II type 1b (AT-1b) receptor Type-1B angiotensin II receptor
Type:
Enzyme Catalytic Domain
Mol. Mass.:
40929.44
Organism:
RAT
Description:
Angiotensin II AT1B 0 RAT::P29089
Residue:
359
  
Inhibitor
Name:
BDBM50282271
Synonyms:
4'-[2-Butyl-4-(2,4-dimethyl-pentyl)-4-methyl-5-oxo-4,5-dihydro-imidazol-1-ylmethyl]-biphenyl-2-carboxylic acid | CHEMBL48392
Type:
Small organic molecule
Emp. Form.:
C29H38N2O3
Mol. Mass.:
462.6236
SMILES:
CCCCC1=NC(C)(CC(C)CC(C)C)C(=O)N1Cc1ccc(cc1)-c1ccccc1C(O)=O
: