Target
Neutrophil elastase
Ligand
BDBM50282864
Substrate
Meas. Tech.
ChEBML_64002
Ki
246±n/a nM
Citation
 Hlasta, DJBell, MRBoaz, NWCourt, JJDesai, RCFranke, CAMura, AJSubramanyam, CDunlap, RP A benzisothiazolone class of potent, selective mechanism-based inhibitors of human leukocyte elastase Bioorg Med Chem Lett 4:1801-1806 (1994)    Article 
Target
Name:
Neutrophil elastase
Synonyms:
Bone marrow serine protease Coagulation factor X ELANE Elastase HLE Leukocyte elastase Medullasin Neutrophil elastase (HNE) PMN elastase Trypsin
Type:
Enzyme
Mol. Mass.:
28532.38
Organism:
Homo sapiens (Human)
Description:
P08246
Residue:
267
  
Inhibitor
Name:
BDBM50282864
Synonyms:
2-(4-Methyl-4H-[1,2,4]triazol-3-ylsulfanylmethyl)-1,1-dioxo-1,2-dihydro-1lambda*6*-benzo[d]isothiazol-3-one | CHEMBL50526
Type:
Small organic molecule
Emp. Form.:
C11H10N4O3S2
Mol. Mass.:
310.352
SMILES:
Cn1cnnc1SCN1C(=O)c2ccccc2S1(=O)=O
: