Target
Neutrophil elastase
Ligand
BDBM50282872
Substrate
Meas. Tech.
ChEBML_64002
Ki
32±n/a nM
Citation
 Hlasta, DJBell, MRBoaz, NWCourt, JJDesai, RCFranke, CAMura, AJSubramanyam, CDunlap, RP A benzisothiazolone class of potent, selective mechanism-based inhibitors of human leukocyte elastase Bioorg Med Chem Lett 4:1801-1806 (1994)    Article 
Target
Name:
Neutrophil elastase
Synonyms:
Bone marrow serine protease Coagulation factor X ELANE Elastase HLE Leukocyte elastase Medullasin Neutrophil elastase (HNE) PMN elastase Trypsin
Type:
Enzyme
Mol. Mass.:
28532.38
Organism:
Homo sapiens (Human)
Description:
P08246
Residue:
267
  
Inhibitor
Name:
BDBM50282872
Synonyms:
2-(1-Cyclohexyl-1H-tetrazol-5-ylsulfanylmethyl)-1,1-dioxo-1,2-dihydro-1lambda*6*-benzo[d]isothiazol-3-one | CHEMBL53523
Type:
Small organic molecule
Emp. Form.:
C15H17N5O3S2
Mol. Mass.:
379.457
SMILES:
O=C1N(CSc2nnnn2C2CCCCC2)S(=O)(=O)c2ccccc12
: