Target
Neutrophil elastase
Ligand
BDBM50282878
Substrate
Meas. Tech.
ChEBML_64002
Ki
14±n/a nM
Citation
 Hlasta, DJBell, MRBoaz, NWCourt, JJDesai, RCFranke, CAMura, AJSubramanyam, CDunlap, RP A benzisothiazolone class of potent, selective mechanism-based inhibitors of human leukocyte elastase Bioorg Med Chem Lett 4:1801-1806 (1994)    Article 
Target
Name:
Neutrophil elastase
Synonyms:
Bone marrow serine protease Coagulation factor X ELANE Elastase HLE Leukocyte elastase Medullasin Neutrophil elastase (HNE) PMN elastase Trypsin
Type:
Enzyme
Mol. Mass.:
28532.38
Organism:
Homo sapiens (Human)
Description:
P08246
Residue:
267
  
Inhibitor
Name:
BDBM50282878
Synonyms:
4-Methoxy-1,1-dioxo-2-(1-phenyl-1H-tetrazol-5-ylsulfanylmethyl)-1,2-dihydro-1lambda*6*-benzo[d]isothiazol-3-one | CHEMBL432890
Type:
Small organic molecule
Emp. Form.:
C16H13N5O4S2
Mol. Mass.:
403.436
SMILES:
COc1cccc2c1C(=O)N(CSc1nnnn1-c1ccccc1)S2(=O)=O
: