Target
Muscarinic acetylcholine receptor M1
Ligand
BDBM50003359
Substrate
Meas. Tech.
ChEMBL_138804 (CHEMBL751539)
IC50
10±n/a nM
Citation
 Quimby, SJShannon, HEBymaster, FPSauerberg, POlesen, PHSheardown, MJSuzdak, PDMitch, CH Synthesis and structure activity relationships of alkyl substituted analogues of the functional M1 selective muscarinic receptor agonist xanomeline Bioorg Med Chem Lett 4:2205-2210 (1994)    Article 
Target
Name:
Muscarinic acetylcholine receptor M1
Synonyms:
ACM1_RAT Chrm-1 cholinergic receptor, muscarinic 1
Type:
Enzyme Catalytic Domain
Mol. Mass.:
51390.46
Organism:
RAT
Description:
P08482
Residue:
460
  
Inhibitor
Name:
BDBM50003359
Synonyms:
5-(4-Hexyloxy-[1,2,5]thiadiazol-3-yl)-1-methyl-1,2,3,6-tetrahydro-pyridine; oxalic acid CHEMBL21536 LY 246708 | Xanomeline
Type:
Small organic molecule
Emp. Form.:
C14H23N3OS
Mol. Mass.:
281.417
SMILES:
CCCCCCOc1nsnc1C1=CCCN(C)C1
: