Target
Polyunsaturated fatty acid 5-lipoxygenase
Ligand
BDBM50283977
Substrate
Meas. Tech.
ChEMBL_4047 (CHEMBL620778)
IC50
91±n/a nM
Citation
 Satoh, YLibby, AHPowers, CKowalski, TJWhite, DKimble, EF Benzoxepin and benzothiepin derivatives as potent, orally active inhibitors of 5-lipoxygenase Bioorg Med Chem Lett 4:549-552 (1994)    Article 
Target
Name:
Polyunsaturated fatty acid 5-lipoxygenase
Synonyms:
5-LO 5-Lipoxygenase (5-LO) 5-Lipoygenase ALOX5 LOG5 | LOX5_HUMAN
Type:
Enzyme
Mol. Mass.:
77972.74
Organism:
Homo sapiens (Human)
Description:
Recombinant protein was purified from E. coli lysate. After ammonium sulfate precipitation and subsequent steps, the supernatant (S100) was used for 5-LO activity assay.
Residue:
674
  
Inhibitor
Name:
BDBM50283977
Synonyms:
CHEMBL355979 | N-{[7-(4-fluorophenoxy)-2,3-dihydro-1-benzoxepin-4-yl]methyl}-N-hydroxyurea
Type:
Small organic molecule
Emp. Form.:
C18H17FN2O4
Mol. Mass.:
344.337
SMILES:
NC(=O)N(O)CC1=Cc2cc(Oc3ccc(F)cc3)ccc2OCC1
: