Target
Muscarinic acetylcholine receptor M1
Ligand
BDBM50284324
Substrate
Meas. Tech.
ChEMBL_139842 (CHEMBL745740)
Kd
423±n/a nM
Citation
 Malaska, MJFauq, AHKozikowski, APAagaard, PJMcKinney, M Chemical modification of ring c of himbacine: Discovery of a pharmacophoric element for M2-selectivity Bioorg Med Chem Lett 5:61-66 (1995)    Article 
Target
Name:
Muscarinic acetylcholine receptor M1
Synonyms:
ACM1_HUMAN Cholinergic receptor, muscarinic 1 | Cholinergic, muscarinic M1
Type:
Protein
Mol. Mass.:
51442.54
Organism:
Homo sapiens (Human)
Description:
P11229
Residue:
460
  
Inhibitor
Name:
BDBM50284324
Synonyms:
(1S,3S,3aR,4R,4aS,8aR,9aS)-4-[(E)-2-((2R,6S)-1,6-Dimethyl-piperidin-2-yl)-vinyl]-3-methyl-dodecahydro-naphtho[2,3-c]furan-1-ol | CHEMBL159237
Type:
Small organic molecule
Emp. Form.:
C22H37NO2
Mol. Mass.:
347.5347
SMILES:
C[C@@H]1O[C@H](O)[C@H]2C[C@H]3CCCC[C@@H]3[C@@H](\C=C\[C@H]3CCC[C@H](C)N3C)[C@@H]12
: