Target
Matrilysin
Ligand
BDBM50284755
Substrate
Meas. Tech.
ChEBML_105051
Ki
18±n/a nM
Citation
 Castelhano, ALBilledeau, RDewdney, NDonnelly, SHorne, SKurz, LJLiak, TJMartin, RUppington, RYuan, ZKrantz, A Novel indolactam-based inhibitors of matrix metalloproteinases Bioorg Med Chem Lett 5:1415-1420 (1995)    Article 
Target
Name:
Matrilysin
Synonyms:
MMP7 MPSL1 Matrix metalloproteinase-7 (MMP-7) PUMP1
Type:
Enzyme
Mol. Mass.:
29681.54
Organism:
Homo sapiens (Human)
Description:
P09237
Residue:
267
  
Inhibitor
Name:
BDBM50284755
Synonyms:
2-[(Formyl-hydroxy-amino)-methyl]-4-methyl-pentanoic acid ((11S,18R)-9-oxo-1,8-diaza-tricyclo[10.6.1.0*13,18*]nonadeca-12(19),13(18),14,16-tetraen-10-yl)-amide | CHEMBL30980
Type:
Small organic molecule
Emp. Form.:
C25H36N4O4
Mol. Mass.:
456.5777
SMILES:
CC(C)C[C@H](CN(O)C=O)C(=O)N[C@H]1Cc2cn(CCCCCCNC1=O)c1ccccc21
: