Target
Kynureninase
Ligand
BDBM50284766
Substrate
Meas. Tech.
ChEBML_91726
IC50
100000±n/a nM
Citation
 Natalini, BMattoli, LPellicciari, RCarpenedo, RChiarugi, AMoroni, F Synthesis and activity of enantiopure (S) (m-nitrobenzoyl) alanine, potent kynurenine-3-hydroxylase inhibitor Bioorg Med Chem Lett 5:1451-1454 (1995)    Article 
Target
Name:
Kynureninase
Synonyms:
KYNU_RAT | Kynu
Type:
PROTEIN
Mol. Mass.:
52470.50
Organism:
Rattus norvegicus
Description:
ChEMBL_91725
Residue:
464
  
Inhibitor
Name:
BDBM50284766
Synonyms:
(R)-2-Amino-4-(3-nitro-phenyl)-4-oxo-butyric acid | CHEMBL35957
Type:
Small organic molecule
Emp. Form.:
C10H10N2O5
Mol. Mass.:
238.1968
SMILES:
N[C@H](CC(=O)c1cccc(c1)[N+]([O-])=O)C(O)=O
: