Target
Neutrophil elastase
Ligand
BDBM50285280
Substrate
Meas. Tech.
ChEMBL_86286 (CHEMBL698901)
Ki
0.049±n/a nM
Citation
 Desai, RCDunlap, RPFarrell, RPFerguson, EFranke, CAGordon, RHlasta, DJTalomie, TG Alkoxy substituted benzisothiazolone (BIT) derivatives: potent inhibitors of human leukocyte elastase Bioorg Med Chem Lett 5:105-109 (1995)    Article 
Target
Name:
Neutrophil elastase
Synonyms:
Bone marrow serine protease Coagulation factor X ELANE Elastase HLE Leukocyte elastase Medullasin Neutrophil elastase (HNE) PMN elastase Trypsin
Type:
Enzyme
Mol. Mass.:
28532.38
Organism:
Homo sapiens (Human)
Description:
P08246
Residue:
267
  
Inhibitor
Name:
BDBM50285280
Synonyms:
2,6-Dichloro-benzoic acid 4-ethoxy-6-methoxy-1,1,3-trioxo-1,3-dihydro-1lambda*6*-benzo[d]isothiazol-2-ylmethyl ester | CHEMBL11558
Type:
Small organic molecule
Emp. Form.:
C18H15Cl2NO7S
Mol. Mass.:
460.285
SMILES:
CCOc1cc(OC)cc2c1C(=O)N(COC(=O)c1c(Cl)cccc1Cl)S2(=O)=O
: