Target
Sterol O-acyltransferase 1
Ligand
BDBM50450329
Substrate
Meas. Tech.
ChEBML_28486
IC50
2000±n/a nM
Citation
 Wilde, RJBillheimer, JTGermain, SJGillies, PJHigley, CAKezar, HSMaduskuie, TPShimshick, ESWexler, RR Acyl CoA:cholesterol acyltransferase (ACAT) inhibitors: ureas bearing heterocyclic groups bioisosteric for an imidazole Bioorg Med Chem Lett 5:167-72 (1995)   
Target
Name:
Sterol O-acyltransferase 1
Synonyms:
ACAT-1 Acat SOAT1_RAT Sterol O-acyltransferase, Soat
Type:
PROTEIN
Mol. Mass.:
64165.56
Organism:
Rattus norvegicus
Description:
ChEMBL_28796
Residue:
545
  
Inhibitor
Name:
BDBM50450329
Synonyms:
CHEMBL295079
Type:
Small organic molecule
Emp. Form.:
C19H32N6O2S
Mol. Mass.:
408.561
SMILES:
CCCCCCN(CCOCCSc1nc2c[nH]cnc2n1)C(=O)NC(C)C
: