Target
Sterol O-acyltransferase 1
Ligand
BDBM50450338
Substrate
Meas. Tech.
ChEBML_28027
IC50
5320±n/a nM
Citation
 Wilde, RJBillheimer, JTGermain, SJGillies, PJHigley, CAKezar, HSMaduskuie, TPShimshick, ESWexler, RR Acyl CoA:cholesterol acyltransferase (ACAT) inhibitors: ureas bearing heterocyclic groups bioisosteric for an imidazole Bioorg Med Chem Lett 5:167-72 (1995)   
Target
Name:
Sterol O-acyltransferase 1
Synonyms:
ACAT-1 Acetoacetyl-CoA thiolase Acyl coenzyme A:cholesterol acyltransferase 1 Cholesterol acyltransferase 1 Soat1 | Sterol O-acyltransferase 1
Type:
PROTEIN
Mol. Mass.:
63818.83
Organism:
Mus musculus
Description:
ChEMBL_90523
Residue:
540
  
Inhibitor
Name:
BDBM50450338
Synonyms:
CHEMBL416816
Type:
Small organic molecule
Emp. Form.:
C24H32F2N6OS
Mol. Mass.:
490.612
SMILES:
CCCCCCCN(CCCCCSc1[nH]cnc2ncnc12)C(=O)Nc1ccc(F)cc1F
: