Target
Sterol O-acyltransferase 1
Ligand
BDBM50450314
Substrate
Meas. Tech.
ChEBML_28486
IC50
2000±n/a nM
Citation
 Wilde, RJBillheimer, JTGermain, SJGillies, PJHigley, CAKezar, HSMaduskuie, TPShimshick, ESWexler, RR Acyl CoA:cholesterol acyltransferase (ACAT) inhibitors: ureas bearing heterocyclic groups bioisosteric for an imidazole Bioorg Med Chem Lett 5:167-72 (1995)   
Target
Name:
Sterol O-acyltransferase 1
Synonyms:
ACAT-1 Acat SOAT1_RAT Sterol O-acyltransferase, Soat
Type:
PROTEIN
Mol. Mass.:
64165.56
Organism:
Rattus norvegicus
Description:
ChEMBL_28796
Residue:
545
  
Inhibitor
Name:
BDBM50450314
Synonyms:
CHEMBL417187
Type:
Small organic molecule
Emp. Form.:
C25H31F2N5O3S
Mol. Mass.:
519.607
SMILES:
CCCCCCN(CCCCCSc1nc2cc(ccc2[nH]1)[N+]([O-])=O)C(=O)Nc1ccc(F)cc1F
: