Target
Sterol O-acyltransferase 1
Ligand
BDBM50450322
Substrate
Meas. Tech.
ChEMBL_28485 (CHEMBL646056)
IC50
90±n/a nM
Citation
 Wilde, RJBillheimer, JTGermain, SJGillies, PJHigley, CAKezar, HSMaduskuie, TPShimshick, ESWexler, RR Acyl CoA:cholesterol acyltransferase (ACAT) inhibitors: ureas bearing heterocyclic groups bioisosteric for an imidazole Bioorg Med Chem Lett 5:167-72 (1995)   
Target
Name:
Sterol O-acyltransferase 1
Synonyms:
ACAT-1 Acat SOAT1_RAT Sterol O-acyltransferase, Soat
Type:
PROTEIN
Mol. Mass.:
64165.56
Organism:
Rattus norvegicus
Description:
ChEMBL_28796
Residue:
545
  
Inhibitor
Name:
BDBM50450322
Synonyms:
CHEMBL431934
Type:
Small organic molecule
Emp. Form.:
C31H44N4O2S
Mol. Mass.:
536.772
SMILES:
CCCCCCCN(CCCCCOC1=NC(S)=NC1(c1ccccc1)c1ccccc1)C(=O)NC(C)C
: