Target
Sterol O-acyltransferase 1
Ligand
BDBM50450342
Substrate
Meas. Tech.
ChEBML_28486
IC50
4000±n/a nM
Citation
 Wilde, RJBillheimer, JTGermain, SJGillies, PJHigley, CAKezar, HSMaduskuie, TPShimshick, ESWexler, RR Acyl CoA:cholesterol acyltransferase (ACAT) inhibitors: ureas bearing heterocyclic groups bioisosteric for an imidazole Bioorg Med Chem Lett 5:167-72 (1995)   
Target
Name:
Sterol O-acyltransferase 1
Synonyms:
ACAT-1 Acat SOAT1_RAT Sterol O-acyltransferase, Soat
Type:
PROTEIN
Mol. Mass.:
64165.56
Organism:
Rattus norvegicus
Description:
ChEMBL_28796
Residue:
545
  
Inhibitor
Name:
BDBM50450342
Synonyms:
CHEMBL295286
Type:
Small organic molecule
Emp. Form.:
C27H35F2N5OS
Mol. Mass.:
515.662
SMILES:
CCCCCCCN(CCCCCSc1n[nH]c(n1)-c1ccccc1)C(=O)Nc1ccc(F)cc1F
: