Target
Sterol O-acyltransferase 1
Ligand
BDBM50450324
Substrate
Meas. Tech.
ChEBML_28486
IC50
3600±n/a nM
Citation
 Wilde, RJBillheimer, JTGermain, SJGillies, PJHigley, CAKezar, HSMaduskuie, TPShimshick, ESWexler, RR Acyl CoA:cholesterol acyltransferase (ACAT) inhibitors: ureas bearing heterocyclic groups bioisosteric for an imidazole Bioorg Med Chem Lett 5:167-72 (1995)   
Target
Name:
Sterol O-acyltransferase 1
Synonyms:
ACAT-1 Acat SOAT1_RAT Sterol O-acyltransferase, Soat
Type:
PROTEIN
Mol. Mass.:
64165.56
Organism:
Rattus norvegicus
Description:
ChEMBL_28796
Residue:
545
  
Inhibitor
Name:
BDBM50450324
Synonyms:
CHEMBL45913
Type:
Small organic molecule
Emp. Form.:
C22H38N6O3S
Mol. Mass.:
466.641
SMILES:
CCCCCCN(CCCCCSc1nc2c([nH]1)n(C)c(=O)n(C)c2=O)C(=O)NC(C)C
: